{"text_format":"1","workbook":"xlsx","n_sheets":13,"sheets":["PRESTAMOS OTORGADOS","APORTE-PRESTAMO-INTER","RENDICION","CUOTA MENSUAL","Hoja1","LISTA NEGRA","LIBRO_AUXILIAR","RESUMEN KR","DSCTO PRESTAMO","DEV CANASTA Y CUOTA","Hoja3","RESUMEN CANASTA Y CUOTAS","RESUMEN INGRESOS PRESTAMOS"],"not_rendered":{"charts":0,"images":0,"macros":0,"external_links":0,"defined_names":10,"comments":8,"pivot_tables":0},"unopened":[],"bounds":{"document_bytes":16777216,"sheet_cells":100000,"rows_first":2000,"rows_last":500,"rows_between":2000,"halvings":0,"cell_chars":16384,"cell_head_chars":4096},"cells_cut":0,"cells_raw":0,"read":"whole","date_system":"1900"}

{"sheet":"PRESTAMOS OTORGADOS","index":0,"n_rows":59,"n_cols":23,"rows_kept":59,"cut":false,"hidden":false,"merged":[[0,0,0,21]]}
["PRESTAMOS AÑO 2024"]
["Nº","N° D.N.I.","FECHA","N° B/E","APELLIDOS Y NOMBRES","TIPO CONTRATO","D.N.I. N° ","ENERO","FEBRERO","MARZO","ABRIL","MAYO","JUNIO","JULIO","AGOSTO","SEPTIEMBRE","OCTUBRE","NOVIEMBRE","DICIEMBRE","TOTAL PRESTAMO","INTERESES","TOTAL","SALDO"]
[1,"17933727",null,null,"AHUANARI ZUMBA, RICARDO","CAS",40291265,1000,500,0,0,0,0,0,0,0,0,0,0,{"$f":"SUM(H3:S3)","v":1500},{"$f":"T3*10%","v":150},{"$f":"+T3+U3","v":1650}]
[2,"00802127",null,null,"ASPAJO CHUMBE, VICTOR RAUL","CAS",42821941,200,800,0,0,0,800,0,1600,0,0,0,0,3400,340,3740]
[3,"16680144",null,null,"BARDALEZ ALVA, ANITA MERCEDES",276,"00819657",3000,0,0,0,0,0,0,0,0,0,0,0,3000,300,3300]
[4,"41931092",null,null,"BEJARANO AGUILAR, MAGALY ROCIO","CAS",43180463,3000,0,0,3000,0,0,0,2000,0,0,0,0,8000,800,8800]
[5,"40360384",null,null,"BEJARANO AROSEMENA, AUREA MILAGROS","CAS","45541324",0,0,0,500,0,0,0,0,0,0,0,0,500,50,550]
[6,"06796264",null,null,"BAZAN VARGAS, KIEFFER SEGUNDO",276,6796264,null,null,null,null,null,null,2500,null,null,null,null,null,{"$f":"SUM(H8:S8)","v":2500},{"$f":"T8*10%","v":250},{"$f":"+T8+U8","v":2750}]
{"$rows_left_out":52}
{"sheet":"APORTE-PRESTAMO-INTER","index":1,"n_rows":109,"n_cols":96,"rows_kept":109,"cut":false,"hidden":true,"merged":[[94,0,94,1],[1,23,1,29],[1,30,1,36],[1,37,1,43],[1,44,1,50],[1,2,1,8],[1,1,2,1],[1,0,2,0],[1,16,1,22],[1,9,1,15],[1,86,1,92],[1,79,1,85],[1,65,1,71],[1,72,1,78],[0,0,0,92],[1,58,1,64],[1,51,1,57]]}
["APORTACIONES, PRESTAMOS Y OTROS - 2012"]
["Nº","APELLIDOS Y NOMBRES","ENERO",null,null,null,null,null,null,"FEBRERO",null,null,null,null,null,null,"MARZO",null,null,null,null,null,null,"ABRIL",null,null,null,null,null,null,"MAYO",null,null,null,null,null,null,"JUNIO",null,null,null,null,null,null,"JULIO",null,null,null,null,null,null,"AGOSTO",null,null,null,null,null,null,"SEPTIEMBRE",null,null,null,null,null,null,"OCTUBRE",null,null,null,null,null,null,"NOVIEMBRE",null,null,null,null,null,null,"DICIEMBRE",null,null,null,null,null,null,"TOTAL"]
[null,null,"APORTE","PREST.","TOTAL","CANASTA","OTROS","TOTAL","TOTAL ENERO","APORTE","PREST.","TOTAL","CANASTA","OTROS","TOTAL","TOTAL FEBRERO","APORTE","PREST.","TOTAL","CANASTA","OTROS","TOTAL","TOTAL MARZO","APORTE","PREST.","TOTAL","CANASTA","OTROS","TOTAL","TOTAL ABRIL","APORTE","PREST.","TOTAL","CANASTA","OTROS","TOTAL","TOTAL MAYO","APORTE","PREST.","TOTAL","CANASTA","OTROS","TOTAL","TOTAL JUNIO","APORTE","PREST.","TOTAL","CANASTA","OTROS","TOTAL","TOTAL JULIO","APORTE","PREST.","TOTAL","CANASTA","OTROS","TOTAL","TOTAL AGOSTO","APORTE","PREST.","TOTAL","CANASTA","OTROS","TOTAL","TOTAL SEPTIEMB","APORTE","PREST.","TOTAL","CANASTA","OTROS","TOTAL","TOTAL OCTUBRE","APORTE","PREST.","TOTAL","CANASTA","OTROS","TOTAL","TOTAL NOVIEM","APORTE","PREST.","TOTAL","CANASTA","OTROS","TOTAL","TOTAL DICIEM","APORTE","PREST. INT.","SUB TOTAL","CANASTA","OTROS","SUB TOTAL","TOTAL AÑO"]
[1,"ADAN ALLUI, NANCY",0,null,{"$f":"+C4+D4","v":0},null,15,{"$f":"+F4+G4","v":15},{"$f":"+E4+H4","v":15},null,null,{"$f":"+J4+K4","v":0},null,null,{"$f":"+M4+N4","v":0},{"$f":"+L4+O4","v":0},null,null,{"$f":"+Q4+R4","v":0},null,30,{"$f":"+T4+U4","v":30},{"$f":"+S4+V4","v":30},null,null,{"$f":"+X4+Y4","v":0},null,null,{"$f":"+AA4+AB4","v":0},{"$f":"+Z4+AC4","v":0},null,null,{"$f":"+AE4+AF4","v":0},null,{"$f":"15+15","v":30},{"$f":"+AH4+AI4","v":30},{"$f":"+AG4+AJ4","v":30},null,null,{"$f":"+AL4+AM4","v":0},null,null,{"$f":"+AO4+AP4","v":0},{"$f":"+AN4+AQ4","v":0},null,null,{"$f":"+AS4+AT4","v":0},null,null,{"$f":"+AV4+AW4","v":0},{"$f":"+AU4+AX4","v":0},null,null,{"$f":"+AZ4+BA4","v":0},null,null,{"$f":"+BC4+BD4","v":0},{"$f":"+BB4+BE4","v":0},null,null,{"$f":"+BG4+BH4","v":0},null,null,{"$f":"+BJ4+BK4","v":0},{"$f":"+BI4+BL4","v":0},null,null,{"$f":"+BN4+BO4","v":0},null,null,{"$f":"+BQ4+BR4","v":0},{"$f":"+BP4+BS4","v":0},null,null,{"$f":"+BU4+BV4","v":0},null,null,{"$f":"+BX4+BY4","v":0},{"$f":"+BW4+BZ4","v":0},null,null,{"$f":"+CB4+CC4","v":0},null,null,{"$f":"+CE4+CF4","v":0},{"$f":"+CD4+CG4","v":0},{"$f":"+C4+J4+Q4+X4+AE4+AL4+AS4+AZ4+BG4+BN4+BU4+CB4","v":0},{"$f":"+D4+K4+R4+Y4+AF4+AM4+AT4+BA4+BH4+BO4+BV4+CC4","v":0},{"$f":"+CI4+CJ4","v":0},{"$f":"+F4+M4+T4+AA4+AH4+AO4+AV4+BC4+BJ4+BQ4+BX4+CE4","v":0},{"$f":"+G4+N4+U4+AB4+AI4+AP4+AW4+BD4+BK4+BR4+BY4+CF4","v":75},{"$f":"+CL4+CM4","v":75},{"$f":"+CK4+CN4","v":75}]
[2,"AGUILAR ARTEAGA, ROSALI SANTIAGO",0,null,{"$f":"+C5+D5","v":0},32.5,null,{"$f":"+F5+G5","v":32.5},{"$f":"+E5+H5","v":32.5},null,null,{"$f":"+J5+K5","v":0},25,null,{"$f":"+M5+N5","v":25},{"$f":"+L5+O5","v":25},null,null,{"$f":"+Q5+R5","v":0},25,null,{"$f":"+T5+U5","v":25},{"$f":"+S5+V5","v":25},null,null,{"$f":"+X5+Y5","v":0},20,null,{"$f":"+AA5+AB5","v":20},{"$f":"+Z5+AC5","v":20},null,null,{"$f":"+AE5+AF5","v":0},5,null,{"$f":"+AH5+AI5","v":5},{"$f":"+AG5+AJ5","v":5},null,null,{"$f":"+AL5+AM5","v":0},12.5,null,{"$f":"+AO5+AP5","v":12.5},{"$f":"+AN5+AQ5","v":12.5},null,null,{"$f":"+AS5+AT5","v":0},20,null,{"$f":"+AV5+AW5","v":20},{"$f":"+AU5+AX5","v":20},null,null,{"$f":"+AZ5+BA5","v":0},20,null,{"$f":"+BC5+BD5","v":20},{"$f":"+BB5+BE5","v":20},null,null,{"$f":"+BG5+BH5","v":0},null,null,{"$f":"+BJ5+BK5","v":0},{"$f":"+BI5+BL5","v":0},null,null,{"$f":"+BN5+BO5","v":0},null,null,{"$f":"+BQ5+BR5","v":0},{"$f":"+BP5+BS5","v":0},null,null,{"$f":"+BU5+BV5","v":0},null,null,{"$f":"+BX5+BY5","v":0},{"$f":"+BW5+BZ5","v":0},null,null,{"$f":"+CB5+CC5","v":0},null,null,{"$f":"+CE5+CF5","v":0},{"$f":"+CD5+CG5","v":0},{"$f":"+C5+J5+Q5+X5+AE5+AL5+AS5+AZ5+BG5+BN5+BU5+CB5","v":0},{"$f":"+D5+K5+R5+Y5+AF5+AM5+AT5+BA5+BH5+BO5+BV5+CC5","v":0},{"$f":"+CI5+CJ5","v":0},{"$f":"+F5+M5+T5+AA5+AH5+AO5+AV5+BC5+BJ5+BQ5+BX5+CE5","v":160},{"$f":"+G5+N5+U5+AB5+AI5+AP5+AW5+BD5+BK5+BR5+BY5+CF5","v":0},{"$f":"+CL5+CM5","v":160},{"$f":"+CK5+CN5","v":160}]
[3,"APAESTEGUI HUANCA, LUZ HERMELINDA",0,null,0,null,null,0,0,null,null,0,null,null,0,0,null,null,0,null,null,0,0,null,null,0,null,null,0,0,null,null,0,null,null,0,0,null,null,0,null,75,75,75,null,null,0,null,null,0,0,null,null,0,null,null,0,0,null,null,{"$f":"+BG6+BH6","v":0},null,null,0,0,null,null,0,null,null,0,0,null,null,0,null,null,0,0,null,null,0,null,null,0,0,0,0,0,0,75,75,75]
[4,"ARIAS VASQUEZ, ALDO",0,null,0,null,null,0,0,5,null,5,40,null,40,45,5,null,5,40,null,40,45,null,null,0,null,null,0,0,10,68,78,20,null,20,98,5,80,85,20,null,20,105,5,63,68,20,null,20,88,5,63,68,20,null,20,88,null,null,0,null,null,0,0,null,null,0,null,null,0,0,null,null,0,null,null,0,0,null,null,0,null,null,0,0,35,274,309,160,0,160,469,166]
[5,"ARIAS NORIEGA, CECILIA",5,null,5,null,null,0,5,5,null,5,null,null,0,5,5,null,5,null,null,0,5,5,null,5,null,null,0,5,5,null,5,null,null,0,5,5,null,5,null,null,0,5,5,null,5,null,null,0,5,5,null,5,null,null,0,5,null,null,0,null,null,0,0,null,null,0,null,null,0,0,null,null,0,null,null,0,0,null,null,0,null,null,0,0,40,0,40,0,0,0,40]
{"$rows_left_out":102}
{"sheet":"RENDICION","index":2,"n_rows":67,"n_cols":6,"rows_kept":67,"cut":false,"hidden":false,"merged":[[54,0,61,0],[64,2,64,3],[65,2,65,3],[66,2,66,3],[4,0,8,0],[9,0,14,0],[15,0,24,0],[25,0,32,0],[33,0,40,0],[41,0,53,0]]}
[]
[]
[]
["MES","CONCEPTO","INGRESOS","EGRESOS"]
["JUNIO","SALDO ANTERIOR JUNIO ",33401.080000000009]
[null,"REUNION SINDICAL (ENTREGA TESORERIA Y CENA)",null,593]
[null,"DEVOLUCION DE APORTACION PARA CANASTA NAVIDEÑA (276) (1 PERSONA)",null,500]
[null,"REFRIGERIO EN EL PARO DEL 19 Y 20/06/2024",null,86]
{"$rows_left_out":60}
{"sheet":"CUOTA MENSUAL","index":3,"n_rows":129,"n_cols":19,"rows_kept":129,"cut":false,"hidden":false,"merged":[[127,8,127,9],[128,7,128,9],[118,7,118,10],[124,8,124,9],[125,8,125,9],[121,8,121,9],[128,0,128,2],[126,1,126,2],[121,1,121,2],[127,1,127,2],[119,0,119,3],[0,0,0,7],[69,0,69,2],[71,0,71,7],[116,0,116,2],[119,7,119,10]]}
["RELACION DE TAPS. NOMBRADOS Y CONTRATADOS PLAZO FIJO 276, QUE REALIZAN LABOR ADMINISTRATIVA QUE APORTAN VOLUNTARIAMENTE AL SITRAS-BM, MENSUALMENTE EL MONTO DE S/. 10.00 Y APORTE PARA CANASTA, CORRESPONDIENTE AL MES DE JULIO - 2024"]
["Nº","Nº DNI","NOMBRES Y APELLIDOS ","CUOTA","PRESTAMO","CANASTA","OTROS","TOTAL","saldo"]
[1,804505,"ARIAS NORIEGA, CECILIA",10,null,null,null,{"$f":"SUM(D3:E3,F3,G3)","v":10},{"$f":"IFERROR(VLOOKUP(B3,'DSCTO PRESTAMO'!$C$4:$E$29,3,0),0)","v":0}]
[2,819657,"BARDALEZ ALVA, ANITA MERCEDES",10,300,null,null,{"$f":"SUM(D4:E4,F4,G4)","v":310},{"$f":"IFERROR(VLOOKUP(B4,'DSCTO PRESTAMO'!$C$4:$E$29,3,0),0)","v":0},"enero a noviembre  S/, 300 mensual"]
[3,807060,"BAZAN VELA, SAMUEL",10,null,100,null,{"$f":"SUM(D5:E5,F5,G5)","v":110},{"$f":"IFERROR(VLOOKUP(B5,'DSCTO PRESTAMO'!$C$4:$E$29,3,0),0)","v":0}]
[4,830793,"CENTURION TAPIA, BEATRIZ",10,null,null,null,{"$f":"SUM(D6:E6,F6,G6)","v":10},{"$f":"IFERROR(VLOOKUP(B6,'DSCTO PRESTAMO'!$C$4:$E$29,3,0),0)","v":0}]
[5,1045926,"CHACON DEL AGUILA, GLADYS",10,null,null,null,10,{"$f":"IFERROR(VLOOKUP(B7,'DSCTO PRESTAMO'!$C$4:$E$29,3,0),0)","v":0}]
[6,43143883,"CORONEL BARDALES, MIKE",10,null,100,null,110,{"$f":"IFERROR(VLOOKUP(B8,'DSCTO PRESTAMO'!$C$4:$E$29,3,0),0)","v":0}]
{"$rows_left_out":122}
{"sheet":"Hoja1","index":4,"n_rows":32,"n_cols":17,"rows_kept":32,"cut":false,"hidden":false,"merged":[[13,0,13,1],[2,0,2,2],[4,0,4,2],[12,7,12,8],[12,14,12,15],[19,6,19,8],[19,13,19,15],[15,14,15,15],[16,14,16,15],[17,7,17,8],[18,7,18,8],[18,14,18,15]]}
[]
[]
[]
[]
["DEUDAS ANTERIORES"]
[1,"CORDOVA ENCALADA, ROLANDO",1375]
[2,"GONZALES SIMARRA, JHON HENRY",3300]
[3,"MAFALDO MACEDO, ABRAHAM",960,{"$f":"C8/3","v":320}]
{"$rows_left_out":25}
{"sheet":"LISTA NEGRA","index":5,"n_rows":15,"n_cols":3,"rows_kept":15,"cut":false,"hidden":true,"merged":[]}
[]
[]
[]
[]
[]
[]
[]
[]
{"$rows_left_out":8}
{"sheet":"LIBRO_AUXILIAR","index":6,"n_rows":459,"n_cols":14,"rows_kept":459,"cut":false,"hidden":false,"merged":[[410,0,410,8],[223,0,223,8],[253,0,253,8],[285,0,285,8],[314,0,314,8],[344,0,344,8],[373,0,373,8],[182,0,182,8],[0,0,0,8],[1,0,1,8],[30,0,30,8],[80,0,80,8],[150,0,150,8]]}
["SINDICATO DE TRABAJADORES ADMINISTRATIVOS DEL SECTOR SALUD - BASE MOYOBAMBA"]
["ENERO - 2024"]
["Nº ORDEN","FECHA","DOC.","Nº DOC.","CONCEPTO","INGRESO","EGRESO",null,"SALDO"]
[null,null,null,null,"SALDO INICIAL S/.",null,null,null,58496.480000000003]
["01",null,null,40291265,"PRESTAMO: AHUANARI ZUMBA, RICARDO",0,1000,{"$f":"F5-G5","v":-1000},{"$f":"I4+H5","v":57496.480000000003}]
["02",null,null,"00819657","PRESTAMO: BARDALEZ ALVA, ANITA MERCEDES",0,3000,-3000,54496.480000000003]
["03",null,null,43180463,"PRESTAMO: BEJARANO AGUILAR, MAGALY ROCIO",0,3000,-3000,51496.480000000003]
["04",null,null,"17838963","PRESTAMO: CABALLERO FERNANDEZ, MARIA ELEANA",0,1000,-1000,50496.480000000003]
{"$rows_left_out":452}
{"sheet":"RESUMEN KR","index":7,"n_rows":141,"n_cols":74,"rows_kept":141,"cut":false,"hidden":false,"merged":[[1,63,1,67],[0,0,0,67],[1,0,2,0],[1,1,2,1],[1,3,1,7],[1,8,1,12],[1,13,1,17],[1,18,1,22],[1,23,1,27],[1,28,1,32],[1,33,1,37],[1,38,1,42],[1,43,1,47],[1,48,1,52],[1,53,1,57],[1,58,1,62],[4,68,4,73],[5,68,5,72],[31,68,31,72],[32,68,32,72],[42,68,42,72],[138,0,138,1],[46,73,46,77],[76,23,76,27],[76,28,76,32],[76,33,76,37],[76,38,76,42],[76,43,76,47],[76,48,76,52],[76,0,77,0],[76,1,77,1],[76,3,76,7],[76,8,76,12],[76,13,76,17],[72,0,72,1],[75,0,75,67],[46,68,46,72],[76,18,76,22],[50,68,50,72],[51,68,51,72],[76,53,76,57],[76,58,76,62],[76,63,76,67],[52,68,52,72],[53,68,53,72]]}
["DESCUENTO PRESTAMOS "]
["Nº","APELLIDOS Y NOMBRES",null,"ENERO",null,null,null,null,"FEBRERO",null,null,null,null,"MARZO",null,null,null,null,"ABRIL",null,null,null,null,"MAYO",null,null,null,null,"JUNIO",null,null,null,null,"JULIO",null,null,null,null,"AGOSTO",null,null,null,null,"SEPTIEMBRE",null,null,null,null,"OCTUBRE",null,null,null,null,"NOVIEMBRE",null,null,null,null,"DICIEMBRE",null,null,null,null,"TOTAL"]
[null,null,"DNI","CUOTA","PREST.","CANASTA","OTROS","TOTAL","CUOTA","PREST.","CANASTA","OTROS","TOTAL","CUOTA","PREST.","CANASTA","OTROS","TOTAL","CUOTA","PREST.","CANASTA","OTROS","TOTAL","CUOTA","PREST.","CANASTA","OTROS","TOTAL","CUOTA","PREST.","CANASTA","OTROS","TOTAL","CUOTA","PREST.","CANASTA","OTROS","TOTAL","CUOTA","PREST.","CANASTA","OTROS","TOTAL","CUOTA","PREST.","CANASTA","OTROS","TOTAL","CUOTA","PREST.","CANASTA","OTROS","TOTAL","CUOTA","PREST.","CANASTA","OTROS","TOTAL","CUOTA","PREST.","CANASTA","OTROS","TOTAL","CUOTA","PREST.","CANASTA","OTROS","TOTAL"]
[1,"ARIAS NORIEGA, CECILIA",804505,10,0,0,0,{"$f":"SUM(D4,E4,F4,G4)","v":10},10,0,0,0,{"$f":"SUM(I4,J4,K4,L4)","v":10},10,0,0,0,{"$f":"SUM(N4,O4,P4,Q4)","v":10},10,0,0,0,{"$f":"SUM(S4,T4,U4,V4)","v":10},10,0,0,0,{"$f":"SUM(X4,Y4,Z4,AA4)","v":10},10,0,0,0,{"$f":"SUM(AC4,AD4,AE4,AF4)","v":10},10,0,0,0,{"$f":"SUM(AH4,AI4,AJ4,AK4)","v":10},10,0,0,0,{"$f":"SUM(AM4,AN4,AO4,AP4)","v":10},10,0,0,0,{"$f":"SUM(AR4,AS4,AT4,AU4)","v":10},10,0,0,0,{"$f":"SUM(AW4,AX4,AY4,AZ4)","v":10},10,0,0,0,{"$f":"SUM(BB4,BC4,BD4,BE4)","v":10},0,0,0,0,{"$f":"SUM(BG4,BH4,BI4,BJ4)","v":0},{"$f":"SUM(D4,I4,N4,S4,X4,AC4,AH4,AM4,AR4,AW4,BB4,BG4)","v":110},0,0,{"$f":"SUM(G4,L4,Q4,V4,AA4,AF4,AK4,AP4,AU4,AZ4,BE4,BR4,BJ4)","v":0},{"$f":"SUM(H4,M4,R4,W4,AB4,AG4,AL4,AQ4,AV4,BA4,BF4,BK4)","v":110}]
[2,"BARDALEZ ALVA, ANITA MERCEDES",819657,10,300,0,0,{"$f":"SUM(D5,E5,F5,G5)","v":310},10,300,0,0,{"$f":"SUM(I5,J5,K5,L5)","v":310},10,300,0,0,{"$f":"SUM(N5,O5,P5,Q5)","v":310},10,300,"  ",0,{"$f":"SUM(S5,T5,U5,V5)","v":310},10,300,0,0,{"$f":"SUM(X5,Y5,Z5,AA5)","v":310},10,300,0,0,{"$f":"SUM(AC5,AD5,AE5,AF5)","v":310},10,300,0,0,{"$f":"SUM(AH5,AI5,AJ5,AK5)","v":310},10,300,0,0,{"$f":"SUM(AM5,AN5,AO5,AP5)","v":310},10,300,0,0,{"$f":"SUM(AR5,AS5,AT5,AU5)","v":310},10,300,0,0,310,10,300,0,0,310,0,0,0,0,0,110,{"$f":"SUM(E5,J5,O5,T5,Y5,AD5,AI5,AN5,AS5,AX5,BC5,BH5)","v":3300},0,0,3410]
[3,"BAZAN VELA, SAMUEL",807060,10,0,100,0,110,10,0,100,0,110,10,0,100,0,110,10,0,100,0,110,10,0,100,0,110,10,0,100,0,110,10,0,100,0,{"$f":"SUM(AH6,AI6,AJ6,AK6)","v":110},10,0,100,0,110,0,0,0,0,0,0,0,0,0,0,0,0,0,0,0,0,0,0,0,0,80,0,800,0,880]
[4,"BAZAN VARGAS, KIEFFER SEGUNDO",6796264,null,null,null,null,null,null,null,null,null,null,null,null,null,null,null,null,null,null,null,null,null,null,null,null,null,null,null,null,null,null,0,550,0,0,550,null,550,null,null,550,null,550,null,null,550,0,550,0,0,550,0,550,0,0,550,0,0,0,0,0,{"$f":"SUM(D7,I7,N7,S7,X7,AC7,AH7,AM7,AR7,AW7,BB7,BG7)","v":0},{"$f":"SUM(E7,J7,O7,T7,Y7,AD7,AI7,AN7,AS7,AX7,BC7,BH7)","v":2750},{"$f":"SUM(F7,K7,P7,U7,Z7,AE7,AJ7,AO7,AT7,AY7,BD7,BI7)","v":0},{"$f":"SUM(G7,L7,Q7,V7,AA7,AF7,AK7,AP7,AU7,AZ7,BE7,BR7,BJ7)","v":0},{"$f":"SUM(H7,M7,R7,W7,AB7,AG7,AL7,AQ7,AV7,BA7,BF7,BK7)","v":2750}]
[5,"CENTURION TAPIA, BEATRIZ",830793,10,0,0,0,10,10,0,0,0,10,10,0,0,0,10,10,0,0,0,10,10,0,0,0,10,10,0,0,0,10,10,0,0,0,10,10,0,0,0,10,10,0,0,0,10,10,0,0,0,10,10,0,0,0,10,0,0,0,0,0,110,0,0,0,110]
{"$rows_left_out":134}
{"sheet":"DSCTO PRESTAMO","index":8,"n_rows":65,"n_cols":48,"rows_kept":65,"cut":false,"hidden":false,"merged":[[33,35,33,37],[33,38,33,40],[33,41,33,43],[62,0,62,1],[33,17,33,19],[33,20,33,22],[33,23,33,25],[33,26,33,28],[33,29,33,31],[33,32,33,34],[33,0,34,0],[33,1,34,1],[33,5,33,7],[33,8,33,10],[33,11,33,13],[33,14,33,16],[29,0,29,1],[32,0,32,43],[1,26,1,28],[1,29,1,31],[1,32,1,34],[1,35,1,37],[1,38,1,40],[1,41,1,43],[0,0,0,43],[1,0,2,0],[1,1,2,1],[1,5,1,7],[1,8,1,10],[1,11,1,13],[1,14,1,16],[1,17,1,19],[1,20,1,22],[1,23,1,25]]}
["DESCUENTO PRESTAMOS "]
["Nº","APELLIDOS Y NOMBRES",null,"PRESTAMO OTORGADO","SALDO","ENERO",null,null,"FEBRERO",null,null,"MARZO",null,null,"ABRIL",null,null,"MAYO",null,null,"JUNIO",null,null,"JULIO",null,null,"AGOSTO",null,null,"SETIEMBRE",null,null,"OCTUBRE",null,null,"NOVIEMBRE",null,null,"DICIEMBRE",null,null,"ACUMULADO"]
[null,null,"DNI",null,null,"PREST.","OTROS","TOTAL","PREST.","OTROS","TOTAL","PREST.","OTROS","TOTAL","PREST.","OTROS","TOTAL","PREST.","OTROS","TOTAL","PREST.","OTROS","TOTAL","PREST.","OTROS","TOTAL","PREST.","OTROS","TOTAL","PREST.","OTROS","TOTAL","PREST.","OTROS","TOTAL","PREST.","OTROS","TOTAL","PREST.","OTROS","TOTAL","PREST.","OTROS","TOTAL","SALDO"]
[1,"BARDALEZ ALVA, ANITA MERCEDES",819657,{"$f":"'PRESTAMOS OTORGADOS'!V5","v":3300},{"$f":"D4-AR4","v":0},300,0,{"$f":"F4+G4","v":300},300,0,{"$f":"I4+J4","v":300},300,0,{"$f":"L4+M4","v":300},300,0,{"$f":"O4+P4","v":300},300,0,{"$f":"R4+S4","v":300},300,0,{"$f":"U4+V4","v":300},300,0,{"$f":"X4+Y4","v":300},300,0,{"$f":"AA4+AB4","v":300},300,0,{"$f":"AD4+AE4","v":300},300,0,{"$f":"AG4+AH4","v":300},300,0,{"$f":"AJ4+AK4","v":300},0,0,{"$f":"AM4+AN4","v":0},{"$f":"SUM(F4,I4,L4,O4,R4,U4,X4,AA4,AD4,AG4,AJ4,AM4)","v":3300},{"$f":"SUM(G4,J4,M4,P4,S4,V4,Y4,AB4,AE4,AH4,AK4,AT4,AN4)","v":0},{"$f":"SUM(H4,K4,N4,Q4,T4,W4,Z4,AC4,AF4,AI4,AL4,AO4)","v":3300},{"$f":"D4-AR4","v":0}]
[2,"BAZAN VARGAS, KIEFFER SEGUNDO",6796264,{"$f":"'PRESTAMOS OTORGADOS'!V8","v":2750},{"$f":"D5-AR5","v":0},null,null,null,null,null,null,null,null,null,null,null,null,null,null,null,null,null,null,550,null,550,550,null,550,550,null,550,550,null,550,550,null,550,null,null,null,2750,null,{"$f":"SUM(H5,K5,N5,Q5,T5,W5,Z5,AC5,AF5,AI5,AL5,AO5)","v":2750},{"$f":"D5-AR5","v":0}]
[3,"CORDOVA CAMPOS, CLARA",860881,{"$f":"'PRESTAMOS OTORGADOS'!V14","v":1100},{"$f":"D6-AR6","v":-1},0,0,0,0,0,0,123,0,123,123,0,123,123,0,123,123,0,123,122,0,122,{"$f":"122+365","v":487},0,487,0,0,0,0,0,0,0,0,0,0,0,0,1101,0,{"$f":"SUM(H6,K6,N6,Q6,T6,W6,Z6,AC6,AF6,AI6,AL6,AO6)","v":1101},{"$f":"D6-AR6","v":-1}]
[4,"CALAMPA MAS, ELVIA JOSEFINA",7018656,{"$f":"'PRESTAMOS OTORGADOS'!V10","v":3300},{"$f":"D7-AR7","v":-1.5},0,0,{"$f":"F7+G7","v":0},0,0,{"$f":"I7+J7","v":0},367,0,{"$f":"L7+M7","v":367},367,0,{"$f":"O7+P7","v":367},367,0,{"$f":"R7+S7","v":367},367,0,{"$f":"U7+V7","v":367},367,0,{"$f":"X7+Y7","v":367},367,0,{"$f":"AA7+AB7","v":367},367,0,{"$f":"AD7+AE7","v":367},{"$f":"365.5+367","v":732.5},0,{"$f":"AG7+AH7","v":732.5},0,0,{"$f":"AJ7+AK7","v":0},0,0,{"$f":"AM7+AN7","v":0},{"$f":"SUM(F7,I7,L7,O7,R7,U7,X7,AA7,AD7,AG7,AJ7,AM7)","v":3301.5},{"$f":"SUM(G7,J7,M7,P7,S7,V7,Y7,AB7,AE7,AH7,AK7,AT7,AN7)","v":0},{"$f":"SUM(H7,K7,N7,Q7,T7,W7,Z7,AC7,AF7,AI7,AL7,AO7)","v":3301.5},{"$f":"D7-AR7","v":-1.5}]
[5,"CAMPOS AVALOS, MOISES RAMIRO",18169707,{"$f":"'PRESTAMOS OTORGADOS'!V11","v":3300},{"$f":"D8-AR8","v":0},0,0,{"$f":"F8+G8","v":0},0,0,{"$f":"I8+J8","v":0},550,0,{"$f":"L8+M8","v":550},0,0,{"$f":"O8+P8","v":0},0,0,{"$f":"R8+S8","v":0},550,0,{"$f":"U8+V8","v":550},550,0,{"$f":"X8+Y8","v":550},550,0,{"$f":"AA8+AB8","v":550},550,0,{"$f":"AD8+AE8","v":550},550,0,{"$f":"AG8+AH8","v":550},0,0,{"$f":"AJ8+AK8","v":0},0,0,{"$f":"AM8+AN8","v":0},{"$f":"SUM(F8,I8,L8,O8,R8,U8,X8,AA8,AD8,AG8,AJ8,AM8)","v":3300},{"$f":"SUM(G8,J8,M8,P8,S8,V8,Y8,AB8,AE8,AH8,AK8,AT8,AN8)","v":0},{"$f":"SUM(H8,K8,N8,Q8,T8,W8,Z8,AC8,AF8,AI8,AL8,AO8)","v":3300},{"$f":"D8-AR8","v":0}]
{"$rows_left_out":58}
{"sheet":"DEV CANASTA Y CUOTA","index":9,"n_rows":106,"n_cols":61,"rows_kept":106,"cut":false,"hidden":false,"merged":[[62,43,62,46],[62,47,62,50],[62,51,62,54],[103,0,103,1],[62,19,62,22],[62,23,62,26],[62,27,62,30],[62,31,62,34],[62,35,62,38],[62,39,62,42],[62,0,63,0],[62,1,63,1],[62,3,62,6],[62,7,62,10],[62,11,62,14],[62,15,62,18],[58,0,58,1],[61,0,61,54],[37,60,37,64],[1,31,1,34],[1,35,1,38],[1,39,1,42],[1,43,1,46],[1,47,1,50],[1,51,1,54],[0,0,0,54],[1,0,2,0],[1,1,2,1],[1,3,1,6],[1,7,1,10],[1,11,1,14],[1,15,1,18],[1,19,1,22],[1,23,1,26],[1,27,1,30]]}
["DESCUENTO PRESTAMOS "]
["Nº","APELLIDOS Y NOMBRES",null,"ENERO",null,null,null,"FEBRERO",null,null,null,"MARZO",null,null,null,"ABRIL",null,null,null,"MAYO",null,null,null,"JUNIO",null,null,null,"JULIO",null,null,null,"AGOSTO",null,null,null,"SEPTIEMBRE",null,null,null,"OCTUBRE",null,null,null,"NOVIEMBRE",null,null,null,"DICIEMBRE",null,null,null,"TOTAL"]
[null,null,"DNI","CUOTA","CANASTA","OTROS","TOTAL","CUOTA","CANASTA","OTROS","TOTAL","CUOTA","CANASTA","OTROS","TOTAL","CUOTA","CANASTA","OTROS","TOTAL","CUOTA","CANASTA","OTROS","TOTAL","CUOTA","CANASTA","OTROS","TOTAL","CUOTA","CANASTA","OTROS","TOTAL","CUOTA","CANASTA","OTROS","TOTAL","CUOTA","CANASTA","OTROS","TOTAL","CUOTA","CANASTA","OTROS","TOTAL","CUOTA","CANASTA","OTROS","TOTAL","CUOTA","CANASTA","OTROS","TOTAL","CUOTA","CANASTA","OTROS","TOTAL","DEVOLUCION","SALDO ","FECHA"]
[1,"ARIAS NORIEGA, CECILIA",804505,10,0,0,{"$f":"SUM(D4:F4)","v":10},10,0,0,{"$f":"SUM(H4:J4)","v":10},10,0,0,{"$f":"SUM(L4:N4)","v":10},10,0,0,{"$f":"SUM(P4:R4)","v":10},10,0,0,{"$f":"SUM(T4:V4)","v":10},10,0,0,{"$f":"SUM(X4:Z4)","v":10},10,0,0,{"$f":"SUM(AB4:AD4)","v":10},10,0,0,{"$f":"SUM(AF4:AH4)","v":10},10,0,0,{"$f":"SUM(AJ4:AL4)","v":10},10,0,0,{"$f":"SUM(AN4:AP4)","v":10},10,0,0,{"$f":"SUM(AR4:AT4)","v":10},10,0,0,{"$f":"SUM(AV4:AX4)","v":10},{"$f":"SUM(D4,H4,L4,P4,T4,X4,AB4,AF4,AJ4,AN4,AR4,AV4)","v":120},{"$f":"SUM(E4,I4,M4,Q4,U4,Y4,AC4,AG4,AK4,AO4,AS4,AW4)","v":0},{"$f":"SUM(F4,J4,N4,R4,V4,Z4,AD4,AH4,AL4,AP4,AT4,AX4)","v":0},{"$f":"SUM(G4,K4,O4,S4,W4,AA4,AE4,AI4,AM4,AQ4,AU4,AY4)","v":120},120,{"$f":"BC4-BD4","v":0},"2024-12-17"]
[2,"BARDALEZ ALVA, ANITA MERCEDES",819657,10,0,0,{"$f":"SUM(D5:F5)","v":10},10,0,0,{"$f":"SUM(H5:J5)","v":10},10,0,0,{"$f":"SUM(L5:N5)","v":10},10,"  ",0,{"$f":"SUM(P5:R5)","v":10},10,0,0,{"$f":"SUM(T5:V5)","v":10},10,0,0,{"$f":"SUM(X5:Z5)","v":10},10,0,0,{"$f":"SUM(AB5:AD5)","v":10},10,0,0,{"$f":"SUM(AF5:AH5)","v":10},10,0,0,{"$f":"SUM(AJ5:AL5)","v":10},10,0,0,{"$f":"SUM(AN5:AP5)","v":10},10,0,0,{"$f":"SUM(AR5:AT5)","v":10},10,0,0,{"$f":"SUM(AV5:AX5)","v":10},{"$f":"SUM(D5,H5,L5,P5,T5,X5,AB5,AF5,AJ5,AN5,AR5,AV5)","v":120},{"$f":"SUM(E5,I5,M5,Q5,U5,Y5,AC5,AG5,AK5,AO5,AS5,AW5)","v":0},{"$f":"SUM(F5,J5,N5,R5,V5,Z5,AD5,AH5,AL5,AP5,AT5,AX5)","v":0},{"$f":"SUM(G5,K5,O5,S5,W5,AA5,AE5,AI5,AM5,AQ5,AU5,AY5)","v":120},120,{"$f":"BC5-BD5","v":0},"2024-12-17"]
[3,"BAZAN VELA, SAMUEL",807060,10,100,0,110,10,100,0,110,10,100,0,110,10,100,0,110,10,100,0,110,10,100,0,110,10,100,0,110,10,100,0,110,0,0,0,0,0,0,0,0,0,0,0,0,0,0,0,0,80,800,0,880,880,0,"2024-09-03","DEVUELTO A SU ESPOSA"]
[4,"CENTURION TAPIA, BEATRIZ",830793,10,0,0,10,10,0,0,10,10,0,0,10,10,0,0,10,10,0,0,10,10,0,0,10,10,0,0,10,10,0,0,10,10,0,0,10,10,0,0,10,10,0,0,10,0,0,0,0,110,0,0,110,null,110]
[5,"CHACON DEL AGUILA, GLADYS",1045926,10,0,0,10,10,0,0,10,10,0,0,10,10,0,0,10,10,0,0,10,10,0,0,10,10,0,0,10,10,0,0,10,10,0,0,10,10,0,0,10,10,0,0,10,10,0,0,10,120,0,0,120,120,0,"2024-12-17"]
{"$rows_left_out":99}
{"sheet":"Hoja3","index":10,"n_rows":39,"n_cols":16,"rows_kept":39,"cut":false,"hidden":false,"merged":[]}
[]
[]
[]
[]
[]
[]
[]
[]
{"$rows_left_out":32}
{"sheet":"RESUMEN CANASTA Y CUOTAS","index":11,"n_rows":63,"n_cols":3,"rows_kept":63,"cut":false,"hidden":false,"merged":[[30,0,30,1],[62,0,62,1]]}
[]
[]
["INGRESOS TRABAJADORES 276"]
[]
[]
["MES","CONCEPTO","TOTAL"]
["ENERO","CUOTA",420]
["ENERO","CANASTA",3570]
{"$rows_left_out":56}
{"sheet":"RESUMEN INGRESOS PRESTAMOS","index":12,"n_rows":37,"n_cols":2,"rows_kept":37,"cut":false,"hidden":false,"merged":[]}
[]
["INGRESOS PAGOS POR PRESTAMOS 276"]
[]
["MES","TOTAL"]
["ENERO",2025.4]
["FEBRERO",5350]
["MARZO",6537]
["ABRIL",6025]
{"$rows_left_out":29}